{"text_format":"1","workbook":"xlsx","n_sheets":8,"sheets":["Input for Auto Config","Labor_Installation","R5K Details","ORDER","order_hack","Revision History","2017","DropDowns"],"not_rendered":{"charts":0,"images":2,"macros":1,"external_links":0,"defined_names":14,"comments":1,"pivot_tables":0},"unopened":[],"bounds":{"document_bytes":16777216,"sheet_cells":100000,"rows_first":2000,"rows_last":500,"rows_between":2000,"halvings":0,"cell_chars":16384,"cell_head_chars":4096},"cells_cut":0,"cells_raw":0,"read":"whole","date_system":"1900"}

{"sheet":"Input for Auto Config","index":0,"n_rows":35,"n_cols":8,"rows_kept":35,"cut":false,"hidden":false,"merged":[[34,0,34,8],[1,1,1,2],[3,1,3,2],[31,0,31,8],[30,0,30,8],[33,0,33,8],[4,3,4,4],[0,0,0,10],[1,3,1,4],[2,3,2,4],[3,3,3,4],[32,0,32,8]]}
["International Responder 5000 2018 Estimate Sheet v 1.31"]
[null,"Input Config Information",null,"Date:",null,"2018-01-11"]
[null,null,null,"Job Name:",null,"Angol"]
[null,"System Config/Intergrations/Software",null,"Distributor Name:",null,"Cencomex"]
[null,"SIP Telephony Integration (yes or no)","Yes","Salesperson:",null,"Cristian Yañez"]
[null,"Audio Paging to R5K stations in rooms? (yes or no)","Yes"]
[null,"Reporting Software  (yes or no)","Yes"]
[null,"TAP Output to pocket pagers/middleware (yes or no)","Yes"]
[null,"R5K Messaging App (yes or no)","Yes"]
[null,"Number of concurrent users of messaging app"]
[]
[]
[null,"Typical Patient Room Stations/Corridor Lights (Drop Down)","Part Number","Quantity",null,"Typical Patient Room Accessories (Drop Down)","Part Number","Quantity"]
[null,"CLA246 - 4Bulb/1-Point Audio R4K Corridor Light ",{"$f":"IF(B14<>\"\", VLOOKUP(B14, DropDowns!A$1:B$70, 2, FALSE), \"\")","v":"CLA246"},142,null,null,{"$f":"IF(F14<>\"\", VLOOKUP(F14,DropDowns!A$69:B$86, 2, FALSE), \"\")","v":""}]
[null,"R5KDC46 - 6-Point, 4-Point Audio Domeless Controller",{"$f":"IF(B15<>\"\", VLOOKUP(B15, DropDowns!A$1:B$70, 2, FALSE), \"\")","v":"R5KDC46"},218,null,null,{"$f":"IF(F15<>\"\", VLOOKUP(F15,DropDowns!A$69:B$86, 2, FALSE), \"\")","v":""}]
[null,"R5KSDTY -  Duty Station",{"$f":"IF(B16<>\"\", VLOOKUP(B16, DropDowns!A$1:B$70, 2, FALSE), \"\")","v":"R5KSDTY"},3,null,null,{"$f":"IF(F16<>\"\", VLOOKUP(F16,DropDowns!A$69:B$86, 2, FALSE), \"\")","v":""}]
[null,"R5KDC16D - 6-Point, 1 Point Audio Duty Domeless Controller",{"$f":"IF(B17<>\"\", VLOOKUP(B17, DropDowns!A$1:B$70, 2, FALSE), \"\")","v":"R5KDC16D"},3,null,null,{"$f":"IF(F17<>\"\", VLOOKUP(F17,DropDowns!A$69:B$86, 2, FALSE), \"\")","v":""}]
[null,"R5KPS1EA - Enhanced Single Station",{"$f":"IF(B18<>\"\", VLOOKUP(B18, DropDowns!A$1:B$70, 2, FALSE), \"\")","v":"R5KPS1EA"},282,null,null,{"$f":"IF(F18<>\"\", VLOOKUP(F18,DropDowns!A$69:B$86, 2, FALSE), \"\")","v":""}]
[null,"R4KPB23 - SLIM Dual Button w/ Code St",{"$f":"IF(B19<>\"\", VLOOKUP(B19, DropDowns!A$1:B$70, 2, FALSE), \"\")","v":"R4KPB23"},282,null,null,{"$f":"IF(F19<>\"\", VLOOKUP(F19,DropDowns!A$69:B$86, 2, FALSE), \"\")","v":""}]
[null,"R4KPB23 - SLIM Dual Button w/ Code St",{"$f":"IF(B20<>\"\", VLOOKUP(B20, DropDowns!A$1:B$70, 2, FALSE), \"\")","v":"R4KPB23"},89,null,null,{"$f":"IF(F20<>\"\", VLOOKUP(F20,DropDowns!A$69:B$86, 2, FALSE), \"\")","v":""}]
{"$rows_left_out":16}
{"sheet":"Labor_Installation","index":1,"n_rows":39,"n_cols":13,"rows_kept":39,"cut":false,"hidden":false,"merged":[]}
["Cost Summary"]
["Hours","Rate",null,null,null,null,null,"Selling Price Summary"]
[null,null,null,null,null,null,null,null,"Cost","Mark-up","Selling Price",null,"Profit"]
[null,null,"Total Cable Selling Cost -->",null,{"$f":"'R5K Details'!M175","v":0},null,null,"Equipment",{"$f":"order_hack!G205","v":147424},1.7,{"$f":"I4*J4","v":250620.79999999999},null,{"$f":"K4-I4","v":103196.79999999999}]
["Total Labor Costs",null,null,null,null,null,null,"Training",0,1.7,{"$f":"I5*J5","v":0},null,{"$f":"K5-I5","v":0}]
[0,0,"Demolition Labor",null,{"$f":"B6*A6","v":0},null,null,"Cable",{"$f":"E4","v":0},1.7,{"$f":"I6*J6","v":0},null,{"$f":"K6-I6","v":0}]
[{"$f":"order_hack!D203","v":0},0,"Est. Shop Labor ",null,0,null,null,"Labor",{"$f":"E21","v":0},1.5,{"$f":"I7*J7","v":0},null,{"$f":"K7-I7","v":0}]
[{"$f":"'R5K Details'!O175","v":536},0,"Est. Cable Labor",null,0,null,null,"Miscellaneous",{"$f":"E39","v":0},1.7,{"$f":"I8*J8","v":0},null,{"$f":"K8-I8","v":0}]
[{"$f":"order_hack!F203","v":839.8},0,"Est. Field Labor ",null,0,null,null,"Total -->",{"$f":"SUM(I4:I8)","v":147424},null,{"$f":"SUM(K4:K8)","v":250620.79999999999}]
[0,0,"Engineering (7% of Dist Net hardware and Field Labor)",null,0,null,null,null,null,null,null,"Gross Profit -->",{"$f":"SUM(M4:M8)","v":103196.79999999999}]
[0,0,"Warranty",null,0,null,null,null,null,null,null,"Distributor Allowance -->",0]
[0,0,"Coordination",null,{"$f":"A12*B12","v":0},null,null,null,null,null,null,"Net Profit -->",{"$f":"M10-M11","v":103196.79999999999}]
[0,0,"In-Service/Needs Assessment (beyond CAS)",null,0]
[0,0,"Testing / Troubleshooting / Inspection",null,0,null,null,null,null,null,null,"Profitability -->",{"$f":"IF((K9<>0),(M12/K9),0)","v":0.41176470588235292}]
[0,0,"Project Management",null,0,null,null,null,null,"Total Selling Price -->",{"$f":"K9","v":250620.79999999999}]
[0,0,"CAD Drawings",null,0]
[0,0,"Enter your own items",null,0,null,null,null,null,"Sales Tax -->",0]
[0,0,"Enter your own items",null,0]
[0,0,"Enter your own items",null,0]
[{"$f":"SUM(A6:A19)","v":1375.8},"<-- Total Labor Hours "]
{"$rows_left_out":20}
{"sheet":"R5K Details","index":2,"n_rows":175,"n_cols":18,"rows_kept":175,"cut":false,"hidden":false,"merged":[[3,2,3,3],[0,0,0,19],[1,13,1,18],[2,13,2,18],[3,13,3,18],[1,0,1,9],[2,0,2,9],[152,0,152,11],[151,0,151,11],[122,0,122,9],[5,0,5,9],[28,0,28,9],[81,0,81,9],[106,0,106,9]]}
[]
[{"$f":"'Input for Auto Config'!A1:K1","v":"International Responder 5000 2018 Estimate Sheet v 1.31"},null,null,null,null,null,null,null,null,null,null,null,"Job Name:",{"$f":"'Input for Auto Config'!F3","v":"Angol"}]
["Responder 5000 System",null,null,null,null,null,null,null,null,null,null,null,"Distributor Name:",{"$f":"'Input for Auto Config'!F4","v":"Cencomex"}]
[null,null,"Date:",null,{"$f":"'Input for Auto Config'!F2","v":"2018-01-11"},null,null,null,null,null,null,null,"Salesperson:",{"$f":"'Input for Auto Config'!F5","v":"Cristian Yañez"}]
["MANUF.","Part #","Con- 8","Con- 6","Description (Items in Purple Automatically Add Quantities in Yellow Column after Completing the Input for Auto Config Tab)","Con- 8","Con- 6","Auto","Add or Decrease Quantity after Completing Auto Config (See Input for Auto Config Tab)","Qty","List Price","Current (Amps)","Total Current","Shop Hours","Shop Total","Field Hours","Field Total","Notes"]
["Headend"]
["RAULAND","NC2828",null,null,"Head-End Equipment Cabinet",null,null,{"$f":"IF(J11>CEILING((J9+J10)/3,1),J11,CEILING((J9+J10)/3,1))","v":12},null,{"$f":"H7+I7","v":12},{"$f":"VLOOKUP(B7,'2017'!C$4:J$257,7,FALSE)","v":1680},null,null,null,{"$f":"IF(H7*N7=0,\" \",H7*N7)","v":" "},2,{"$f":"IF(H7*P7=0,\" \",H7*P7)","v":24}]
["\"","351102",null,null,"Wall Mounting Cabinet-head-end",null,null,null,null,0,{"$f":"VLOOKUP(B8,'2017'!C$4:J$257,7,FALSE)","v":1145}]
["\"","R5KMPR15",null,null,"Power Supply 15V for Stations, CLs, DCs (w/battery backup)",null,null,{"$f":"CEILING((M150)/2.6, 1)","v":24},null,24,{"$f":"VLOOKUP(B9,'2017'!C$4:J$257,7,FALSE)","v":933},null,null,null,{"$f":"IF(H9*N9=0,\" \",H9*N9)","v":" "},1,{"$f":"IF(H9*P9=0,\" \",H9*P9)","v":24}]
["\"","R5KMPR36",null,null,"Power Supply 36V for MSC, Console (w/battery backup)",null,null,{"$f":"CEILING(SUM(M11:M14)/2.4, 1)+J13","v":12},null,{"$f":"H10+I10","v":12},{"$f":"VLOOKUP(B10,'2017'!C$4:J$257,7,FALSE)","v":900},null,null,null,{"$f":"IF(H10*N10=0,\" \",H10*N10)","v":" "},0.5,{"$f":"IF(H10*P10=0,\" \",H10*P10)","v":6}]
["\"","R5KMSC",null,null,"Main System Controller",null,null,{"$f":"DropDowns!I34","v":3},1,{"$f":"H11+I11","v":4},{"$f":"VLOOKUP(B11,'2017'!C$4:J$257,7,FALSE)","v":1803},2,{"$f":"L11*J11","v":8},null,{"$f":"IF(H11*N11=0,\" \",H11*N11)","v":" "},6,{"$f":"IF(H11*P11=0,\" \",H11*P11)","v":18}]
["\"","351010",null,null,"Responder Network Concentrator",null,null,null,1,{"$f":"H12+I12","v":1},{"$f":"VLOOKUP(B12,'2017'!C$4:J$257,7,FALSE)","v":12108}]
["\"","R5KM8PRT",null,null,"R5K 8-Port Switch",null,null,{"$f":"ROUNDUP(SUM(J11,J23)/8,0)","v":4},4,{"$f":"H13+I13","v":8},{"$f":"VLOOKUP(B13,'2017'!C$4:J$257,7,FALSE)","v":1113},2.4,null,null,null,0.5,{"$f":"IF(H13*P13=0,\" \",H13*P13)","v":2}]
["\"","351006",null,null,"Fiber Optic Adapter Module",null,null,{"$f":"IF(H11>=1,2,0)","v":2},null,{"$f":"H14+I14","v":2},{"$f":"VLOOKUP(B14,'2017'!C$4:J$257,7,FALSE)","v":510},0.75,{"$f":"L14*J14","v":1.5},null,null,2]
["\"","R5KL2KA",null,null,"Data Converter for K-Bus to L-Net",null,null,{"$f":"DropDowns!I46","v":9},null,9,{"$f":"VLOOKUP(B15,'2017'!C$4:J$257,7,FALSE)","v":543},0.13,{"$f":"L15*J15","v":1.17},null,null,8,{"$f":"IF(H15*P15=0,\" \",H15*P15)","v":72}]
["\"","R5KMRPT",null,null,"Reporting Software License (1 per system)",null,null,{"$f":"IF('Input for Auto Config'!C7=\"yes\", 1, 0)","v":1},null,1,{"$f":"VLOOKUP(B16,'2017'!C$4:J$257,7,FALSE)","v":9000},null,null,null,{"$f":"IF(H16*N16=0,\" \",H16*N16)","v":" "},16,{"$f":"IF(H16*P16=0,\" \",H16*P16)","v":16}]
["\"","R5KMSIP",null,null,"SIP Telephony Software License (1 per system)",null,null,{"$f":"IF(AND('Input for Auto Config'!C5=\"\",'Input for Auto Config'!C9=\"\"),0,IF('Input for Auto Config'!C5=\"yes\",1,IF(AND('Input for Auto Config'!C5=\"no\",'Input for Auto Config'!C9=\"yes\"),1,IF(AND('Input for Auto Config'!C5=\"\",'Input for Auto Config'!C9=\"yes\"),1, 0))))","v":1},null,{"$f":"IF(AND(H17=0,I144=1),1,H17+I17)","v":1},{"$f":"VLOOKUP(B17,'2017'!C$4:J$257,7,FALSE)","v":5175},null,null,null,null,6,{"$f":"IF(H17*P17=0,\" \",H17*P17)","v":6}]
["\"","355005",null,null,"Responder SIP Server",null,null,{"$f":"IF(H17=1, 1, 0)","v":1},null,1,{"$f":"VLOOKUP(B18,'2017'!C$4:J$257,7,FALSE)","v":4125},null,null,null,null,6,{"$f":"IF(H18*P18=0,\" \",H18*P18)","v":6}]
["\"","R4KPA25",2,null,"Paging Amplifier",{"$f":"C19*J19","v":18},null,{"$f":"IF('Input for Auto Config'!C6=\"yes\", 'R5K Details'!J15, 0)","v":9},null,{"$f":"H19+I19","v":9},{"$f":"VLOOKUP(B19,'2017'!C$4:J$257,7,FALSE)","v":858},2.5,{"$f":"L19*J19","v":22.5},null,null,4,{"$f":"IF(H19*P19=0,\" \",H19*P19)","v":36}]
["\"","R4KMQCV2",2,null,"Marquee Controller",{"$f":"C20*J20","v":0},null,null,null,{"$f":"I20","v":0},{"$f":"VLOOKUP(B20,'2017'!C$4:J$257,7,FALSE)","v":507},0.3,{"$f":"L20*J20","v":0},null,null,2,{"$f":"IF(J20*P20=0,\" \",J20*P20)","v":" "}]
{"$rows_left_out":156}
{"sheet":"ORDER","index":3,"n_rows":226,"n_cols":9,"rows_kept":226,"cut":false,"hidden":false,"merged":[[198,3,198,5],[0,0,0,2],[210,3,210,5],[208,3,208,5],[209,3,209,5],[205,3,205,5],[199,3,199,5],[200,3,200,5],[201,3,201,5],[193,3,193,4],[194,3,194,5],[195,3,195,5],[196,3,196,5],[197,3,197,5],[206,3,206,5],[207,3,207,5],[210,1,210,2],[205,1,205,2],[206,1,206,2],[207,1,207,2],[208,1,208,2],[209,1,209,2],[195,1,195,2],[196,1,196,2],[223,1,223,2],[224,1,224,2],[225,1,225,2],[165,3,165,4],[166,3,166,4],[170,3,170,5],[171,3,171,5],[172,3,172,5],[175,3,175,4],[176,3,176,4],[191,3,191,5],[192,3,192,4],[182,3,182,5],[183,3,183,5],[184,3,184,5],[185,3,185,4],[186,3,186,4],[187,3,187,5],[188,3,188,5],[189,3,189,5],[190,3,190,5],[224,3,224,5],[217,3,217,4],[204,1,204,2],[221,1,221,2],[222,1,222,2],[211,1,211,2],[212,1,212,2],[213,1,213,2],[214,1,214,2],[215,1,215,2],[216,1,216,2],[217,1,217,2],[218,1,218,2],[219,1,219,2],[220,1,220,2],[197,1,197,2],[198,1,198,2],[199,1,199,2],[200,1,200,2],[201,1,201,2],[202,1,202,2],[203,1,203,2],[193,1,193,2],[194,1,194,2],[184,1,184,2],[185,1,185,2],[186,1,186,2],[187,1,187,2],[188,1,188,2],[189,1,189,2],[190,1,190,2],[191,1,191,2],[192,1,192,2],[182,1,182,2],[183,1,183,2],[172,1,172,2],[173,1,173,2],[174,1,174,2],[175,1,175,2],[176,1,176,2],[177,1,177,2],[178,1,178,2],[179,1,179,2],[180,1,180,2],[181,1,181,2],[0,4,0,5],[1,1,1,3],[1,6,1,7],[6,2,6,3],[6,4,7,4],[7,2,7,3],[2,3,2,4],[4,4,4,7],[2,6,2,7],[2,0,2,2],[3,0,12,0],[6,5,7,7],[5,2,5,3],[5,5,5,7],[12,1,12,2],[0,6,0,7],[1,4,1,5],[3,1,3,2],[3,5,3,6],[4,1,4,3],[8,1,8,7],[9,1,11,1],[9,3,9,7],[10,3,10,4],[10,5,10,6],[11,4,11,6],[12,3,12,4],[13,5,14,6],[13,1,14,1],[13,2,15,2],[13,3,15,3],[13,4,15,4],[15,0,15,1],[89,0,89,2],[89,3,89,5],[95,0,95,5],[90,0,90,5],[13,0,14,0],[119,2,119,3],[119,4,119,5],[13,7,89,7],[117,1,118,6],[99,7,116,7],[116,1,116,3],[116,4,116,6],[99,0,116,0],[108,1,108,3],[107,1,107,3],[101,1,101,3],[110,1,110,3],[109,1,109,3],[114,1,114,3],[115,1,115,5],[91,4,91,5],[111,1,111,3],[112,1,112,3],[113,1,113,3],[96,0,98,1],[91,0,94,2],[133,3,133,7],[122,1,122,6],[125,1,125,7],[131,0,131,7],[124,1,124,6],[120,4,120,5],[121,1,121,7],[126,1,127,4],[126,5,126,6],[120,2,120,3],[128,1,129,4],[128,5,128,6],[129,5,129,6],[132,1,132,7],[118,0,130,0],[123,1,123,6],[100,1,100,6],[133,1,133,2],[130,1,130,7],[102,1,102,3],[170,1,170,2],[171,1,171,2],[161,1,161,2],[162,1,162,2],[163,1,163,2],[164,1,164,2],[165,1,165,2],[134,1,134,2],[139,1,140,1],[139,2,139,7],[140,2,140,7],[137,1,137,7],[135,0,136,7],[166,1,166,2],[167,1,167,2],[168,1,168,2],[169,1,169,2],[158,1,158,2],[158,5,158,6],[159,1,159,2],[160,1,160,2],[159,3,159,5],[142,0,142,7],[141,3,141,5],[0,8,89,50],[90,8,90,13],[91,8,91,13],[90,14,209,48],[92,8,317,13],[210,14,342,48],[97,2,98,6],[99,1,99,4],[96,2,96,4],[127,5,127,6],[149,0,150,7],[148,1,148,7],[145,2,145,4],[138,2,138,7],[151,2,151,3],[178,3,178,5],[179,3,179,5],[162,3,162,5],[163,3,163,5],[168,3,168,5],[143,0,143,7],[161,3,161,5],[146,1,146,4],[147,2,147,5],[141,6,141,7],[151,4,151,5],[151,7,152,7],[152,2,152,3],[152,4,152,5],[144,1,144,7],[160,3,160,5],[134,3,134,7],[103,1,103,3],[104,1,104,3],[106,1,106,3],[105,1,105,3],[154,1,154,3],[154,4,154,7],[153,2,153,3],[155,5,155,7],[156,2,156,3],[156,4,157,4],[157,2,157,3],[156,5,157,7],[155,2,155,3],[225,3,225,5],[164,3,164,5],[167,3,167,5],[169,3,169,5],[173,3,173,5],[174,3,174,5],[177,3,177,5],[180,3,180,5],[181,3,181,5],[202,3,202,4],[203,3,203,4],[204,3,204,5],[220,3,220,4],[218,3,218,5],[219,3,219,5],[221,3,221,4],[222,3,222,5],[223,3,223,5],[212,3,212,5],[216,3,216,4],[213,3,213,5],[214,3,214,5],[215,3,215,5],[211,3,211,4]]}
["Responder 5000 Nurse Call System Purchase Order",null,null,"Project Name:",{"$f":"IF('R5K Details'!N2=\"\",\"\",'R5K Details'!N2)","v":"Angol"},null,"Enter Original date of Quote"]
[null,"Responder 5000 Nurse Call System Order Entry Fax (800) 217-0977",null,null,"Revision Date",null,{"$f":"TODAY()","v":"2018-01-11"}]
["1. Click on the \"Generate Purchase Order\" button to get a complete list of required components for your system. \n2. Fill in the required information in the light yellow cells to complete your order, then sign both pages and fax to Rauland. ",null,null,"Please fill in all Pale Yellow boxes before printing"]
[null,"PURCHASE ORDER  ",null,null,"Dist. P.O. # :"]
[null,"Distributor Information",null,null,"Facility Information"]
[null,"Distributor Name & Address",{"$f":"IF('R5K Details'!N3=\"\",\"\",'R5K Details'!N3)","v":"Cencomex"},null,"Facility Name:"]
[null,"Project Name/No.",null,null,"Facility Address:"]
[null,"Dist. Contact Person:"]
[]
[null,"Shipping Instructions:","Ship To Address:"]
[null,null,"Method of Shipment:",null,null,"Accept Partials? (yes/no):",null,"no"]
[null,null,"Requested Ship Date (mm/dd/yy):",null,"Special Instructions? (yes/no):",null,null,"no"]
[null,"Projected Time Frame for Job ",null,""]
["Qty.","Part Number","Description","List Price Ea.","Extended List Price","Distributor Prices"]
[]
["Head End",null,null,null,null,"Net","Extended Net"]
["Responder 5000"]
[12,"NC2828","Head-End Equipment Cabinet",1680,20160,672,8064]
[24,"R5KMPR15","Power Supply 15V for Stations, CLs, DCs (w/battery backup)",933,22392,311,7464]
[12,"R5KMPR36","Power Supply 36V for MSC, Console (w/battery backup)",900,10800,300,3600]
{"$rows_left_out":207}
{"sheet":"order_hack","index":4,"n_rows":205,"n_cols":11,"rows_kept":205,"cut":false,"hidden":true,"merged":[[134,7,134,8],[140,7,140,8],[102,1,102,4],[0,5,0,6],[1,0,1,3],[0,0,0,3],[2,0,2,3],[99,2,99,3],[109,2,109,3],[197,1,197,4],[3,0,3,4],[4,1,4,4],[184,1,184,4],[156,0,156,1],[111,1,111,4],[182,1,182,3],[169,0,169,1]]}
["Responder 5000 Nurse Call System ",null,null,null,"Project Name:","Project Name"]
[null,null,null,null,"Date:",{"$f":"TODAY()","v":"2018-01-11"}]
[null,null,null,null,null,null,"GPO factor","BOM setting"]
["distributor/dealer discount",null,null,null,null,0.4,1.2]
["R5K"]
[]
["Model # ","Description",null,"Dist Net Price","Extended Price"," List Price","Extended List Price"]
[null,null,null,null,null,null,null,null,null,"# of R4KPR400","# of R5KMPR15"]
["NC2828","Head-End Equipment Cabinet",{"$f":"'R5K Details'!J7","v":12},{"$f":"VLOOKUP(A9,'2017'!C$4:J$257,8,FALSE)","v":672},{"$f":"D9*C9","v":8064},{"$f":"VLOOKUP(A9,'2017'!C$4:J$257,7,FALSE)","v":1680},{"$f":"F9*C9","v":20160},null,null,null,{"$f":"'R5K Details'!J9","v":24}]
["351102","Wall Mounting Cabinet-head-end",{"$f":"'R5K Details'!J8","v":0},{"$f":"VLOOKUP(A10,'2017'!C$4:J$257,8,FALSE)","v":458},{"$f":"D10*C10","v":0},{"$f":"VLOOKUP(A10,'2017'!C$4:J$257,7,FALSE)","v":1145},{"$f":"F10*C10","v":0}]
["R5KMPR15","Power Supply 15V for Stations, CLs, DCs (w/battery backup)",{"$f":"IF(J9=0,K9,K9)","v":24},{"$f":"VLOOKUP(A11,'2017'!C$4:J$257,8,FALSE)","v":311},{"$f":"D11*C11","v":7464},{"$f":"VLOOKUP(A11,'2017'!C$4:J$257,7,FALSE)","v":933},22392]
["R5KMPR36","Power Supply 36V for MSC, Console (w/battery backup)",{"$f":"'R5K Details'!J10","v":12},{"$f":"VLOOKUP(A12,'2017'!C$4:J$257,8,FALSE)","v":300},3600,{"$f":"VLOOKUP(A12,'2017'!C$4:J$257,7,FALSE)","v":900},{"$f":"F12*C12","v":10800}]
["R5KMSC","Main System Controller",{"$f":"'R5K Details'!J11","v":4},{"$f":"VLOOKUP(A13,'2017'!C$4:J$257,8,FALSE)","v":601},2404,{"$f":"VLOOKUP(A13,'2017'!C$4:J$257,7,FALSE)","v":1803},7212]
["351010","Responder Network Concentrator",{"$f":"'R5K Details'!J12","v":1},{"$f":"VLOOKUP(A14,'2017'!C$4:J$257,8,FALSE)","v":4843},{"$f":"D14*C14","v":4843},{"$f":"VLOOKUP(A14,'2017'!C$4:J$257,7,FALSE)","v":12108},{"$f":"F14*C14","v":12108}]
["R5KM8PRT","R5K 8-Port Switch",{"$f":"'R5K Details'!J13","v":8},{"$f":"VLOOKUP(A15,'2017'!C$4:J$257,8,FALSE)","v":371},2968,{"$f":"VLOOKUP(A15,'2017'!C$4:J$257,7,FALSE)","v":1113},8904]
["351006","Fiber Adapter Modules",{"$f":"'R5K Details'!J14","v":2},{"$f":"VLOOKUP(A16,'2017'!C$4:J$257,8,FALSE)","v":204},{"$f":"D16*C16","v":408},{"$f":"VLOOKUP(A16,'2017'!C$4:J$257,7,FALSE)","v":510},{"$f":"F16*C16","v":1020}]
["R5KL2KA","Data Converter for K-Bus to L-Net",{"$f":"'R5K Details'!J15","v":9},{"$f":"VLOOKUP(A17,'2017'!C$4:J$257,8,FALSE)","v":181},1629,{"$f":"VLOOKUP(A17,'2017'!C$4:J$257,7,FALSE)","v":543},4887]
["R5KMTRM","Termination Board",{"$f":"'R5K Details'!J22","v":9},{"$f":"VLOOKUP(A18,'2017'!C$4:J$257,8,FALSE)","v":61},549,{"$f":"VLOOKUP(A18,'2017'!C$4:J$257,7,FALSE)","v":183},1647]
["R5KCONS","VoIP Nurse Console",{"$f":"'R5K Details'!J23","v":24},{"$f":"VLOOKUP(A19,'2017'!C$4:J$257,8,FALSE)","v":612},14688,{"$f":"VLOOKUP(A19,'2017'!C$4:J$257,7,FALSE)","v":1836},44064]
["R4KPA25","Paging Amplifier",{"$f":"'R5K Details'!J19","v":9},{"$f":"VLOOKUP(A20,'2017'!C$4:J$257,8,FALSE)","v":286},2574,{"$f":"VLOOKUP(A20,'2017'!C$4:J$257,7,FALSE)","v":858},7722]
{"$rows_left_out":186}
{"sheet":"Revision History","index":5,"n_rows":80,"n_cols":2,"rows_kept":80,"cut":false,"hidden":false,"merged":[[0,0,0,1]]}
["Release Notes of AutoQuote Program"]
["Version  ","Changes Included"]
[]
["Version 1.31","1. Corrected calculation of R5KL2KA"]
[]
["Version 1.30","1. Corrected R5KSDTY input from Auto Config tab."]
[]
["Version 1.29","1. Corrected calculations for the CLA246 and CLAR46."]
[]
["Version 1.28","1. Added the CLA246 and CLAR46."]
[]
["Version 1.27","1. Corrected Pricing of Other items"]
[null,"2. Changed format of dropdown boxes on Input for Auto Config tab"]
[]
["Version 1.26","1. Added the RNC"]
[]
["Version 1.25","1. Edited device names/descriptions to fit in columns better"]
[]
["Version 1.24","1. Corrected SIP Telephony Integration calculation."]
[null,"2. Corrected number of servers needed for Reports and SIP Integration."]
{"$rows_left_out":61}
{"sheet":"2017","index":6,"n_rows":263,"n_cols":10,"rows_kept":263,"cut":false,"hidden":true,"merged":[]}
["THIS DOCUMENT IS FOR INTERNAL USE ONLY. DO NOT DISTRIBUTE",null,""]
["Pricelist","FY 2018 Item Class","Model #","Description","Warranty","Carton Qty","FY 2018 \nSuggested List \nPrice $US","FY 2018 \nDistributor Net \nPrice $US","FY 2018 \nSuggested List \nPrice $Intl","FY 2018 \nDistributor Net \nPrice $Intl"]
[null,5,"301103","Universal Wireless Wall Unit",60,null,{"$f":"IFERROR(ROUNDUP(H3*2.5,0),\"\")","v":358},143,{"$f":"IFERROR(ROUNDUP(J3*2.5,0),\"\")","v":340},136]
["HC",5,"301200","Wireless Bed Unit-Socket (HR)",60,null,378,151,363,145]
["HC",5,"301210","Wireless Bed Unit-Plug (Stryker)",60,null,378,151,363,145]
["HC",5,"301300","Wireless Bed Interface-Demo",12,null,1030,412,1030,412]
["HC",5,"350000","R5 Demo Kit",12,null,34420,13768,34420,13768]
["HC",5,"350002","L-net T-tap Module (25)",18,null,653,261,643,257]
["HC",5,"350003","L-net Term Resistor (10)",18,null,560,224,540,216]
["HC",5,"350004","L-net Hub",18,null,383,153,298,119]
["HC",5,"350005","M-net Divider Interface",18,null,85,34,65,26]
["HC",5,"350014","Overlay Kit Left Side Stn (10)",18,null,53,21,43,17]
["HC",5,"350015","Overlay Kit Right Side Stn(10)",18,null,53,21,43,17]
["HC",5,"350016","Overlay Kit Staff Term Lcd (5)",18,null,80,32,75,30]
["HC",5,"350017","L-net T-tap Insulator (25)",18,null,78,31,53,21]
["HC",5,"350019","Responder 5 L-net Test Adapter",18,null,85,34,70,28]
["HC",5,"350022","Clear Button Cover For 353001",18,null,48,19,43,17]
["HC",5,"350023","Clear Button Cover-4 Button S",18,null,65,26,65,26]
["HC",5,"350024","Pillow Spker Cord Grip Kit 20",18,null,83,33,83,33]
["HC",5,"350026","1-gang Adapter Plates (10)",18,null,58,23,53,21]
{"$rows_left_out":244}
{"sheet":"DropDowns","index":7,"n_rows":86,"n_cols":9,"rows_kept":86,"cut":false,"hidden":true,"merged":[[30,7,30,8]]}
["R5KPD2EA - Enhnaced Dual Patient Station","R5KPD2EA"]
["R5KPS1EA - Enhanced Single Station","R5KPS1EA",null,"Yes"]
["R5KPD2A -  Dual Patient Station","R5KPD2A",null,"No",{"$f":"E2+10","v":10}]
["R5KPS1A -  Single Audio Patient Station","R5KPS1A",null,null,{"$f":"E3+10","v":20}]
["R5KPS1V -  Single Patient Visual Station","R5KPS1V",null,null,{"$f":"E4+10","v":30}]
["R5KPS1LCA -  Audio Single Patient Station with Lighting Control","R5KPS1LCA",null,null,40]
["R5KSSTF -  Staff Station","R5KSSTF",null,null,50]
["R5KSDTY -  Duty Station","R5KSDTY",null,null,60]
["R4K15V - SLIM 1/4\" Jack / Button St","R4K15V"]
["R4K17V - SLIM Enh Single Call St","R4K17V"]
["HSS400 - High Security Audio Bed Station","HSS400"]
["HSS401 - High Security  Staff Station","HSS401"]
["HSS433 - High Security Push Button Station","HSS433"]
["R5KPB4 -  4-button Workflow and Registration Station","R5KPB4"]
["R4K2JACK - SLIM Dual 1/4\" Jack St","R4K2JACK"]
["R4KCB13 - SLIM Code Button St","R4KCB13"]
["R4KPB12 - SLIM Single Button St","R4KPB12"]
["R4KPB23 - SLIM Dual Button w/ Code St","R4KPB23"]
["R4KPC11 - SLIM Pull Cord St","R4KPC11"]
["R4KSAR - SLIM Dual Button St","R4KSAR",null,null,null,null,"R5KPC11WP - Waterproof Pullcord Station","R5KPC11WP"]
{"$rows_left_out":66}