{"text_format":"1","workbook":"xlsx","n_sheets":8,"sheets":["Input for Auto Config","Labor_Installation","R5K Details","ORDER","order_hack","Revision History","2019","DropDowns"],"not_rendered":{"charts":0,"images":2,"macros":1,"external_links":0,"defined_names":14,"comments":1,"pivot_tables":0},"unopened":[],"bounds":{"document_bytes":16777216,"sheet_cells":100000,"rows_first":2000,"rows_last":500,"rows_between":2000,"halvings":0,"cell_chars":16384,"cell_head_chars":4096},"cells_cut":0,"cells_raw":0,"read":"whole","date_system":"1900"}

{"sheet":"Input for Auto Config","index":0,"n_rows":37,"n_cols":8,"rows_kept":37,"cut":false,"hidden":false,"merged":[[0,0,0,10],[1,3,1,4],[2,3,2,4],[3,3,3,4],[34,0,34,8],[36,0,36,8],[1,1,1,2],[3,1,3,2],[33,0,33,8],[32,0,32,8],[35,0,35,8],[4,3,4,4]]}
["International Responder 5000 2019 Estimate Sheet v 1.50"]
[null,"Input Config Information",null,"Date:",null,"2022-12-26"]
[null,null,null,"Job Name:",null,"HOSPITAL SAN JAVIER"]
[null,"System Config/Intergrations/Software",null,"Distributor Name:",null,"CENCOMEX S.A."]
[null,"SIP Telephony Integration (yes or no)","Yes","Salesperson:",null,"CRISTIAN YAÑEZ"]
[null,"Audio Paging to R5K stations in rooms? (yes or no)","Yes"]
[null,"Display and Reporting Software  (yes or no)","Yes"]
[null,"ADT Integration - Display and Reporting software necessary (yes or no)","Yes"]
[null,"R5K Messaging App (yes or no)"]
[null,"Number of concurrent users of messaging app"]
[null,"Middleware Interface (Including SIP Cancel) (yes or no)","Yes"]
[null,"Resident Safety Interface (yes or no)","Yes"]
[]
[]
[null,"Typical Patient Room Stations/Corridor Lights (Drop Down)","Part Number","Quantity",null,"Typical Patient Room Accessories (Drop Down)","Part Number","Quantity"]
[null,"R5KCL546 - 5-Bulb, 4-Point Audio Corridor Light ",{"$f":"IF(B16<>\"\", VLOOKUP(B16, DropDowns!A$1:B$76, 2, FALSE), \"\")","v":"R5KCL546"},12,null,"CCDIN - Call Cord - Single w/ Clip (10 ft.)",{"$f":"IF(F16<>\"\", VLOOKUP(F16,DropDowns!A$75:B$91, 2, FALSE), \"\")","v":"CCDIN"},41]
[null,"R5KDC06 - 6-Point Visual Domeless Controller",{"$f":"IF(B17<>\"\", VLOOKUP(B17, DropDowns!A$1:B$76, 2, FALSE), \"\")","v":"R5KDC06"},4,null,null,{"$f":"IF(F17<>\"\", VLOOKUP(F17,DropDowns!A$75:B$91, 2, FALSE), \"\")","v":""}]
[null,"R4KSAR - SLIM Dual Button St",{"$f":"IF(B18<>\"\", VLOOKUP(B18, DropDowns!A$1:B$76, 2, FALSE), \"\")","v":"R4KSAR"},12,null,null,{"$f":"IF(F18<>\"\", VLOOKUP(F18,DropDowns!A$75:B$91, 2, FALSE), \"\")","v":""}]
[null,"R5KPS1A -  Single Audio Patient Station",{"$f":"IF(B19<>\"\", VLOOKUP(B19, DropDowns!A$1:B$76, 2, FALSE), \"\")","v":"R5KPS1A"},41,null,null,{"$f":"IF(F19<>\"\", VLOOKUP(F19,DropDowns!A$75:B$91, 2, FALSE), \"\")","v":""}]
[null,"R5KPC11WPS - Waterproof Pullcord Station - Spanish",{"$f":"IF(B20<>\"\", VLOOKUP(B20, DropDowns!A$1:B$76, 2, FALSE), \"\")","v":"R5KPC11WPS"},18,null,null,{"$f":"IF(F20<>\"\", VLOOKUP(F20,DropDowns!A$75:B$91, 2, FALSE), \"\")","v":""}]
{"$rows_left_out":18}
{"sheet":"Labor_Installation","index":1,"n_rows":39,"n_cols":13,"rows_kept":39,"cut":false,"hidden":false,"merged":[]}
["Cost Summary"]
["Hours","Rate",null,null,null,null,null,"Selling Price Summary"]
[null,null,null,null,null,null,null,null,"Cost","Mark-up","Selling Price",null,"Profit"]
[null,null,"Total Cable Selling Cost -->",null,{"$f":"'R5K Details'!M181","v":400},null,null,"Equipment",{"$f":"order_hack!G211","v":7676},1.7,{"$f":"I4*J4","v":13049.199999999999},null,{"$f":"K4-I4","v":5373.1999999999989}]
["Total Labor Costs",null,null,null,null,null,null,"Training",0,1.7,{"$f":"I5*J5","v":0},null,{"$f":"K5-I5","v":0}]
[0,0,"Demolition Labor",null,{"$f":"B6*A6","v":0},null,null,"Cable",{"$f":"E4","v":400},1.7,{"$f":"I6*J6","v":680},null,{"$f":"K6-I6","v":280}]
[{"$f":"order_hack!D209","v":0},0,"Est. Shop Labor ",null,0,null,null,"Labor",{"$f":"E21","v":0},1.5,{"$f":"I7*J7","v":0},null,{"$f":"K7-I7","v":0}]
[{"$f":"'R5K Details'!O181","v":64},0,"Est. Cable Labor",null,0,null,null,"Miscellaneous",{"$f":"E39","v":0},1.7,{"$f":"I8*J8","v":0},null,{"$f":"K8-I8","v":0}]
[{"$f":"order_hack!F209","v":61.2},0,"Est. Field Labor ",null,0,null,null,"Total -->",{"$f":"SUM(I4:I8)","v":8076},null,{"$f":"SUM(K4:K8)","v":13729.199999999999}]
[0,0,"Engineering (7% of Dist Net hardware and Field Labor)",null,0,null,null,null,null,null,null,"Gross Profit -->",{"$f":"SUM(M4:M8)","v":5653.1999999999989}]
[0,0,"Warranty",null,0,null,null,null,null,null,null,"Distributor Allowance -->",0]
[0,0,"Coordination",null,{"$f":"A12*B12","v":0},null,null,null,null,null,null,"Net Profit -->",{"$f":"M10-M11","v":5653.1999999999989}]
[0,0,"In-Service/Needs Assessment (beyond CAS)",null,0]
[0,0,"Testing / Troubleshooting / Inspection",null,0,null,null,null,null,null,null,"Profitability -->",{"$f":"IF((K9<>0),(M12/K9),0)","v":0.41176470588235292}]
[0,0,"Project Management",null,0,null,null,null,null,"Total Selling Price -->",{"$f":"K9","v":13729.199999999999}]
[0,0,"CAD Drawings",null,0]
[0,0,"Enter your own items",null,0,null,null,null,null,"Sales Tax -->",0]
[0,0,"Enter your own items",null,0]
[0,0,"Enter your own items",null,0]
[{"$f":"SUM(A6:A19)","v":125.2},"<-- Total Labor Hours "]
{"$rows_left_out":20}
{"sheet":"R5K Details","index":2,"n_rows":181,"n_cols":18,"rows_kept":181,"cut":false,"hidden":false,"merged":[[158,0,158,11],[157,0,157,11],[128,0,128,9],[5,0,5,9],[31,0,31,9],[87,0,87,9],[112,0,112,9],[3,2,3,3],[0,0,0,19],[1,13,1,18],[2,13,2,18],[3,13,3,18],[1,0,1,9],[2,0,2,9]]}
[]
[{"$f":"'Input for Auto Config'!A1:K1","v":"International Responder 5000 2019 Estimate Sheet v 1.50"},null,null,null,null,null,null,null,null,null,null,null,"Job Name:",{"$f":"'Input for Auto Config'!F3","v":"HOSPITAL SAN JAVIER"}]
["Responder 5000 System",null,null,null,null,null,null,null,null,null,null,null,"Distributor Name:",{"$f":"'Input for Auto Config'!F4","v":"CENCOMEX S.A."}]
[null,null,"Date:",null,{"$f":"'Input for Auto Config'!F2","v":"2022-12-26"},null,null,null,null,null,null,null,"Salesperson:",{"$f":"'Input for Auto Config'!F5","v":"CRISTIAN YAÑEZ"}]
["MANUF.","Part #","Con- 8","Con- 6","Description (Items in Purple Automatically Add Quantities in Yellow Column after Completing the Input for Auto Config Tab)","Con- 8","Con- 6","Auto","Add or Decrease Quantity after Completing Auto Config (See Input for Auto Config Tab)","Qty","List Price","Current (Amps)","Total Current","Shop Hours","Shop Total","Field Hours","Field Total","Notes"]
["Headend"]
["RAULAND","NC2828",null,null,"Head-End Equipment Cabinet",null,null,null,null,{"$f":"H7+I7","v":0},{"$f":"VLOOKUP(B7,'2019'!C$3:H$220,5,FALSE)","v":1680},null,null,null,{"$f":"IF(H7*N7=0,\" \",H7*N7)","v":" "},2,{"$f":"IF(H7*P7=0,\" \",H7*P7)","v":" "}]
["\"","351102",null,null,"Wall Mounting Cabinet-head-end",null,null,null,null,0,{"$f":"VLOOKUP(B8,'2019'!C$3:H$220,5,FALSE)","v":1145}]
["\"","R5KMPR15",null,null,"Power Supply 15V for Stations, CLs, DCs (w/battery backup)",null,null,1,null,1,{"$f":"VLOOKUP(B9,'2019'!C$3:H$220,5,FALSE)","v":933},null,null,null,{"$f":"IF(H9*N9=0,\" \",H9*N9)","v":" "},1,{"$f":"IF(H9*P9=0,\" \",H9*P9)","v":1}]
["\"","R5KMPR36",null,null,"Power Supply 36V for MSC, Console (w/battery backup)",null,null,1,null,{"$f":"H10+I10","v":1},{"$f":"VLOOKUP(B10,'2019'!C$3:H$220,5,FALSE)","v":900},null,null,null,{"$f":"IF(H10*N10=0,\" \",H10*N10)","v":" "},0.5,{"$f":"IF(H10*P10=0,\" \",H10*P10)","v":0.5}]
["\"","R5KMSC",null,null,"Main System Controller",null,null,1,null,{"$f":"H11+I11","v":1},{"$f":"VLOOKUP(B11,'2019'!C$3:H$220,5,FALSE)","v":1803},2,{"$f":"L11*J11","v":2},null,{"$f":"IF(H11*N11=0,\" \",H11*N11)","v":" "},6,{"$f":"IF(H11*P11=0,\" \",H11*P11)","v":6}]
["\"","351010",null,null,"Responder Network Concentrator",null,null,null,null,{"$f":"H12+I12","v":0},{"$f":"VLOOKUP(B12,'2019'!C$3:H$220,5,FALSE)","v":12107.5},null,null,null,null,null,{"$f":"IF(H12*P12=0,\" \",H12*P12)","v":" "}]
["\"","R5KM8PRT",null,null,"R5K 8-Port Switch",null,null,1,-1,{"$f":"H13+I13","v":0},{"$f":"VLOOKUP(B13,'2019'!C$3:H$220,5,FALSE)","v":1113},2.4,null,null,null,0.5,0.5]
["\"","351006",null,null,"Fiber Optic Adapter Module",null,null,null,null,{"$f":"H14+I14","v":0},{"$f":"VLOOKUP(B14,'2019'!C$3:H$220,5,FALSE)","v":510},0.75,{"$f":"L14*J14","v":0},null,null,2," "]
["\"","R5KL2KA",null,null,"Data Converter for K-Bus to L-Net",null,null,1,null,1,{"$f":"VLOOKUP(B15,'2019'!C$3:H$220,5,FALSE)","v":543},0.13,{"$f":"L15*J15","v":0.13},null,null,8,8]
["\"","R5KMRPT",null,null,"Reporting Software License (1 per system)",null,null,null,null,0,{"$f":"VLOOKUP(B16,'2019'!C$3:H$220,5,FALSE)","v":9000},null,null,null,{"$f":"IF(H16*N16=0,\" \",H16*N16)","v":" "},16,{"$f":"IF(H16*P16=0,\" \",H16*P16)","v":" "}]
[null,"R5KMADT",null,null,"ADT Integration Software License (1 per system)",null,null,null,null,0,{"$f":"VLOOKUP(B17,'2019'!C$3:H$220,5,FALSE)","v":3750},null,null,null,{"$f":"IF(H17*N17=0,\" \",H17*N17)","v":" "},16]
[null,"R5KMRSI",null,null,"Resident Safety Interface (1 per system)",null,null,null,null,0,{"$f":"VLOOKUP(B18,'2019'!C$3:H$220,5,FALSE)","v":3000}]
["\"","R5KMSIP",null,null,"SIP Telephony Software License (1 per system)",null,null,null,null,0,{"$f":"VLOOKUP(B19,'2019'!C$3:H$220,5,FALSE)","v":5175},null,null,null,null,6,{"$f":"IF(H19*P19=0,\" \",H19*P19)","v":" "}]
[null,"R5KMMWI",null,null,"Middleware Interface (1 per system)",null,null,null,null,0,{"$f":"VLOOKUP(B20,'2019'!C$3:H$220,5,FALSE)","v":5000}]
{"$rows_left_out":162}
{"sheet":"ORDER","index":3,"n_rows":226,"n_cols":9,"rows_kept":226,"cut":false,"hidden":false,"merged":[[225,3,225,5],[164,3,164,5],[167,3,167,5],[169,3,169,5],[173,3,173,5],[174,3,174,5],[177,3,177,5],[180,3,180,5],[181,3,181,5],[202,3,202,4],[203,3,203,4],[204,3,204,5],[220,3,220,4],[218,3,218,5],[219,3,219,5],[221,3,221,4],[222,3,222,5],[223,3,223,5],[212,3,212,5],[216,3,216,4],[213,3,213,5],[214,3,214,5],[215,3,215,5],[211,3,211,4],[141,6,141,7],[151,4,151,5],[151,7,152,7],[152,2,152,3],[152,4,152,5],[144,1,144,7],[160,3,160,5],[134,3,134,7],[103,1,103,3],[104,1,104,3],[106,1,106,3],[105,1,105,3],[154,1,154,3],[154,4,154,7],[153,2,153,3],[155,5,155,7],[156,2,156,3],[156,4,157,4],[157,2,157,3],[156,5,157,7],[155,2,155,3],[0,8,89,50],[90,8,90,13],[91,8,91,13],[90,14,209,48],[92,8,317,13],[210,14,342,48],[97,2,98,6],[99,1,99,4],[96,2,96,4],[127,5,127,6],[149,0,150,7],[148,1,148,7],[145,2,145,4],[138,2,138,7],[151,2,151,3],[178,3,178,5],[179,3,179,5],[162,3,162,5],[163,3,163,5],[168,3,168,5],[143,0,143,7],[161,3,161,5],[146,1,146,4],[147,2,147,5],[170,1,170,2],[171,1,171,2],[161,1,161,2],[162,1,162,2],[163,1,163,2],[164,1,164,2],[165,1,165,2],[134,1,134,2],[139,1,140,1],[139,2,139,7],[140,2,140,7],[137,1,137,7],[135,0,136,7],[166,1,166,2],[167,1,167,2],[168,1,168,2],[169,1,169,2],[158,1,158,2],[158,5,158,6],[159,1,159,2],[160,1,160,2],[159,3,159,5],[142,0,142,7],[141,3,141,5],[96,0,98,1],[91,0,94,2],[133,3,133,7],[122,1,122,6],[125,1,125,7],[131,0,131,7],[124,1,124,6],[120,4,120,5],[121,1,121,7],[126,1,127,4],[126,5,126,6],[120,2,120,3],[128,1,129,4],[128,5,128,6],[129,5,129,6],[132,1,132,7],[118,0,130,0],[123,1,123,6],[100,1,100,6],[133,1,133,2],[130,1,130,7],[102,1,102,3],[89,0,89,2],[89,3,89,5],[95,0,95,5],[90,0,90,5],[13,0,14,0],[119,2,119,3],[119,4,119,5],[13,7,89,7],[117,1,118,6],[99,7,116,7],[116,1,116,3],[116,4,116,6],[99,0,116,0],[108,1,108,3],[107,1,107,3],[101,1,101,3],[110,1,110,3],[109,1,109,3],[114,1,114,3],[115,1,115,5],[91,4,91,5],[111,1,111,3],[112,1,112,3],[113,1,113,3],[10,5,10,6],[11,4,11,6],[12,3,12,4],[13,5,14,6],[13,1,14,1],[13,2,15,2],[13,3,15,3],[13,4,15,4],[15,0,15,1],[0,4,0,5],[1,1,1,3],[1,6,1,7],[6,2,6,3],[6,4,7,4],[7,2,7,3],[2,3,2,4],[4,4,4,7],[2,6,2,7],[2,0,2,2],[3,0,12,0],[6,5,7,7],[5,2,5,3],[5,5,5,7],[12,1,12,2],[0,6,0,7],[1,4,1,5],[3,1,3,2],[3,5,3,6],[4,1,4,3],[8,1,8,7],[9,1,11,1],[9,3,9,7],[10,3,10,4],[182,1,182,2],[183,1,183,2],[172,1,172,2],[173,1,173,2],[174,1,174,2],[175,1,175,2],[176,1,176,2],[177,1,177,2],[178,1,178,2],[179,1,179,2],[180,1,180,2],[181,1,181,2],[184,1,184,2],[185,1,185,2],[186,1,186,2],[187,1,187,2],[188,1,188,2],[189,1,189,2],[190,1,190,2],[191,1,191,2],[192,1,192,2],[197,1,197,2],[198,1,198,2],[199,1,199,2],[200,1,200,2],[201,1,201,2],[202,1,202,2],[203,1,203,2],[193,1,193,2],[194,1,194,2],[221,1,221,2],[222,1,222,2],[211,1,211,2],[212,1,212,2],[213,1,213,2],[214,1,214,2],[215,1,215,2],[216,1,216,2],[217,1,217,2],[218,1,218,2],[219,1,219,2],[220,1,220,2],[223,1,223,2],[224,1,224,2],[225,1,225,2],[165,3,165,4],[166,3,166,4],[170,3,170,5],[171,3,171,5],[172,3,172,5],[175,3,175,4],[176,3,176,4],[191,3,191,5],[192,3,192,4],[182,3,182,5],[183,3,183,5],[184,3,184,5],[185,3,185,4],[186,3,186,4],[187,3,187,5],[188,3,188,5],[189,3,189,5],[190,3,190,5],[224,3,224,5],[217,3,217,4],[204,1,204,2],[198,3,198,5],[0,0,0,2],[210,3,210,5],[208,3,208,5],[209,3,209,5],[205,3,205,5],[199,3,199,5],[200,3,200,5],[201,3,201,5],[193,3,193,4],[194,3,194,5],[195,3,195,5],[196,3,196,5],[197,3,197,5],[206,3,206,5],[207,3,207,5],[210,1,210,2],[205,1,205,2],[206,1,206,2],[207,1,207,2],[208,1,208,2],[209,1,209,2],[195,1,195,2],[196,1,196,2]]}
["Responder 5000 Nurse Call System Purchase Order",null,null,"Project Name:",{"$f":"IF('R5K Details'!N2=\"\",\"\",'R5K Details'!N2)","v":"HOSPITAL SAN JAVIER"},null,"Enter Original date of Quote"]
[null,"Responder 5000 Nurse Call System Order Entry Fax (800) 217-0977",null,null,"Revision Date",null,{"$f":"TODAY()","v":"2022-12-27"}]
["1. Click on the \"Generate Purchase Order\" button to get a complete list of required components for your system. \n2. Fill in the required information in the light yellow cells to complete your order, then sign both pages and fax to Rauland. ",null,null,"Please fill in all Pale Yellow boxes before printing"]
[null,"PURCHASE ORDER  ",null,null,"Dist. P.O. # :"]
[null,"Distributor Information",null,null,"Facility Information"]
[null,"Distributor Name & Address",{"$f":"IF('R5K Details'!N3=\"\",\"\",'R5K Details'!N3)","v":"CENCOMEX S.A."},null,"Facility Name:"]
[null,"Project Name/No.",null,null,"Facility Address:"]
[null,"Dist. Contact Person:"]
[]
[null,"Shipping Instructions:","Ship To Address:"]
[null,null,"Method of Shipment:",null,null,"Accept Partials? (yes/no):",null,"no"]
[null,null,"Requested Ship Date (mm/dd/yy):",null,"Special Instructions? (yes/no):",null,null,"no"]
[null,"Projected Time Frame for Job ",null,""]
["Qty.","Part Number","Description","List Price Ea.","Extended List Price","Distributor Prices"]
[]
["Head End",null,null,null,null,"Net","Extended Net"]
["Responder 5000"]
[1,"R5KMPR15","Power Supply 15V for Stations, CLs, DCs (w/battery backup)",933,933,311,311]
[1,"R5KMPR36","Power Supply 36V for MSC, Console (w/battery backup)",900,900,300,300]
[1,"R5KMSC","Main System Controller",1803,1803,601,601]
{"$rows_left_out":207}
{"sheet":"order_hack","index":4,"n_rows":211,"n_cols":11,"rows_kept":211,"cut":false,"hidden":false,"merged":[[203,1,203,4],[3,0,3,4],[4,1,4,4],[190,1,190,4],[162,0,162,1],[117,1,117,4],[188,1,188,3],[175,0,175,1],[140,7,140,8],[146,7,146,8],[105,1,105,4],[0,5,0,6],[1,0,1,3],[0,0,0,3],[2,0,2,3],[102,2,102,3],[115,2,115,3]]}
["Responder 5000 Nurse Call System ",null,null,null,"Project Name:","Project Name"]
[null,null,null,null,"Date:",{"$f":"TODAY()","v":"2022-12-27"}]
[null,null,null,null,null,null,"GPO factor","BOM setting"]
["distributor/dealer discount",null,null,null,null,0.4,1.2]
["R5K"]
[]
["Model # ","Description",null,"Dist Net Price","Extended Price"," List Price","Extended List Price"]
[null,null,null,null,null,null,null,null,null,"# of R4KPR400","# of R5KMPR15"]
["NC2828","Head-End Equipment Cabinet",{"$f":"'R5K Details'!J7","v":0},{"$f":"VLOOKUP(A9,'2019'!C$3:H$255,6,FALSE)","v":672},{"$f":"D9*C9","v":0},{"$f":"VLOOKUP(A9,'2019'!C$3:H$225,5,FALSE)","v":1680},{"$f":"F9*C9","v":0},null,null,null,{"$f":"'R5K Details'!J9","v":1}]
["351102","Wall Mounting Cabinet-head-end",{"$f":"'R5K Details'!J8","v":0},{"$f":"VLOOKUP(A10,'2019'!C$3:H$225,6,FALSE)","v":458},{"$f":"D10*C10","v":0},{"$f":"VLOOKUP(A10,'2019'!C$3:H$225,5,FALSE)","v":1145},{"$f":"F10*C10","v":0}]
["R5KMPR15","Power Supply 15V for Stations, CLs, DCs (w/battery backup)",{"$f":"IF(J9=0,K9,K9)","v":1},{"$f":"VLOOKUP(A11,'2019'!C$3:H$225,6,FALSE)","v":311},{"$f":"D11*C11","v":311},{"$f":"VLOOKUP(A11,'2019'!C$3:H$225,5,FALSE)","v":933},933]
["R5KMPR36","Power Supply 36V for MSC, Console (w/battery backup)",{"$f":"'R5K Details'!J10","v":1},{"$f":"VLOOKUP(A12,'2019'!C$3:H$225,6,FALSE)","v":300},300,{"$f":"VLOOKUP(A12,'2019'!C$3:H$225,5,FALSE)","v":900},{"$f":"F12*C12","v":900}]
["R5KMSC","Main System Controller",{"$f":"'R5K Details'!J11","v":1},{"$f":"VLOOKUP(A13,'2019'!C$3:H$225,6,FALSE)","v":601},601,{"$f":"VLOOKUP(A13,'2019'!C$3:H$225,5,FALSE)","v":1803},1803]
["351010","Responder Network Concentrator",{"$f":"'R5K Details'!J12","v":0},{"$f":"VLOOKUP(A14,'2019'!C$3:H$225,6,FALSE)","v":4843},0,{"$f":"VLOOKUP(A14,'2019'!C$3:H$225,5,FALSE)","v":12107.5},{"$f":"F14*C14","v":0}]
["R5KM8PRT","R5K 8-Port Switch",{"$f":"'R5K Details'!J13","v":0},{"$f":"VLOOKUP(A15,'2019'!C$3:H$225,6,FALSE)","v":371},0,{"$f":"VLOOKUP(A15,'2019'!C$3:H$225,5,FALSE)","v":1113},0]
["351006","Fiber Adapter Modules",{"$f":"'R5K Details'!J14","v":0},{"$f":"VLOOKUP(A16,'2019'!C$3:H$225,6,FALSE)","v":204},0,{"$f":"VLOOKUP(A16,'2019'!C$3:H$225,5,FALSE)","v":510},{"$f":"F16*C16","v":0}]
["R5KL2KA","Data Converter for K-Bus to L-Net",{"$f":"'R5K Details'!J15","v":1},{"$f":"VLOOKUP(A17,'2019'!C$3:H$225,6,FALSE)","v":186},186,{"$f":"VLOOKUP(A17,'2019'!C$3:H$225,5,FALSE)","v":543},543]
["R5KMTRM","Termination Board",{"$f":"'R5K Details'!J25","v":1},{"$f":"VLOOKUP(A18,'2019'!C$3:H$225,6,FALSE)","v":61},61,{"$f":"VLOOKUP(A18,'2019'!C$3:H$225,5,FALSE)","v":183},183]
["R5KCONS","VoIP Nurse Console",{"$f":"'R5K Details'!J26","v":1},{"$f":"VLOOKUP(A19,'2019'!C$3:H$225,6,FALSE)","v":612},612,{"$f":"VLOOKUP(A19,'2019'!C$3:H$225,5,FALSE)","v":1836},1836]
["R4KPA25","Paging Amplifier",{"$f":"'R5K Details'!J22","v":0},{"$f":"VLOOKUP(A20,'2019'!C$3:H$225,6,FALSE)","v":286},0,{"$f":"VLOOKUP(A20,'2019'!C$3:H$225,5,FALSE)","v":858},0]
{"$rows_left_out":192}
{"sheet":"Revision History","index":5,"n_rows":121,"n_cols":2,"rows_kept":121,"cut":false,"hidden":false,"merged":[[0,0,0,1]]}
["Release Notes of AutoQuote Program"]
["Version  ","Changes Included"]
[]
["Version 1.50","1. Allow a -1 to be entered for 355005."]
[]
["Version 1.49","1. Corrected the distributor net for the MSIP."]
[]
["Version 1.48","1. Corrected the autocalculation of the R5KL2KA."]
[]
["Version 1.47","1. Corrected the input options for the Input for Auto Config tab."]
[]
["Version 1.46","1. Corrected the auto calculation of R5KMRPT and R5KMSIP when other software modules included."]
[]
["Version 1.45","1. Corrected the Order output for software modules."]
[]
["Version 1.44","1. Added R5KMMWI Middleware Interface.  This requires R5KMSIP."]
[null,"2. Added R5KMRSI Resident Safety Interface.  This requires R5KMRPT."]
[]
["Version 1.43","1. Added R5KMADT ADT Integration Software License.  This requires R5KMRPT."]
[]
{"$rows_left_out":102}
{"sheet":"2019","index":6,"n_rows":218,"n_cols":9,"rows_kept":218,"cut":false,"hidden":false,"merged":[]}
["THIS DOCUMENT IS FOR INTERNAL USE ONLY. DO NOT DISTRIBUTE",null,"",null,null,null,null,null,"discount multiplier"]
["Pricelist",null,"",null,null,null,"List","Dist net Int"]
[null,null,"301103","Responder Wireless Wall Unit",60,null,340,136,0.4]
["HC",null,"301200","Wireless Bed Unit-socket (hr)",60,null,362.5,145,0.4]
["HC",null,"301210","Wb Unit-plug (stryker)",60,null,362.5,145,0.4]
["HC",null,"301300","Wireless Bed Demo Kit-stryker",12,null,1030,412,0.4]
["HC",null,"350000","Demonstration Unit",12,null,34420,13768,0.4]
["HC",null,"350002","L-net T-tap Module (25)",18,null,642.5,257,0.4]
["HC",null,"350003","L-net Term Resistor (10)",18,null,540,216,0.4]
["HC",null,"350004","L-net Hub",18,null,297.5,119,0.4]
["HC",null,"350005","M-net Divider Interface",18,null,65,26,0.4]
["HC",null,"350006","Crimping Tool Adapter",12,null,82.5,33,0.4]
["HC",null,"350007","Station Removal Tool",12,null,40,16,0.4]
["HC",null,"350008","Clear Station Cover",18,null,62.5,25,0.4]
["HC",null,"350009","351003 Battery Kit",18,null,110,44,0.4]
["HC",null,"350011","Overlay Kit Cancel Button (10)",18,null,27.5,11,0.4]
["HC",null,"350012","Overlay Kit Sm Push Button(10)",18,null,27.5,11,0.4]
["HC",null,"350013","Overlay Kit Lg Push Button(10)",18,null,37.5,15,0.4]
["HC",null,"350014","Overlay Kit Left Side Stn (10)",18,null,42.5,17,0.4]
["HC",null,"350015","Overlay Kit Right Side Stn(10)",18,null,42.5,17,0.4]
{"$rows_left_out":199}
{"sheet":"DropDowns","index":7,"n_rows":91,"n_cols":10,"rows_kept":91,"cut":false,"hidden":false,"merged":[[31,7,31,8]]}
["R5KPD2EA - Enhnaced Dual Patient Station","R5KPD2EA"]
["R5KPS1EA - Enhanced Single Station","R5KPS1EA",null,"Yes"]
["R5KPD2A -  Dual Patient Station","R5KPD2A",null,"No",{"$f":"E2+10","v":10}]
["R5KPS1A -  Single Audio Patient Station","R5KPS1A",null,null,{"$f":"E3+10","v":20}]
["R5KPS1V -  Single Patient Visual Station","R5KPS1V",null,null,{"$f":"E4+10","v":30}]
["R5KPS1LCA -  Audio Single Patient Station with Lighting Control","R5KPS1LCA",null,null,40]
["R5KSSTF -  Staff Station","R5KSSTF",null,null,50]
["R5KSDTY -  Duty Station","R5KSDTY",null,null,60]
["R4K15V - SLIM 1/4\" Jack / Button St","R4K15V"]
["R4K17V - SLIM Enh Single Call St","R4K17V"]
["HSS400 - High Security Audio Bed Station","HSS400"]
["HSS401 - High Security  Staff Station","HSS401"]
["HSS433 - High Security Push Button Station","HSS433"]
["R5KPB4 -  4-button Station","R5KPB4"]
["R5KPB4CNF -  4-button CNF Station","R5KPB4CNF"]
["R4K2JACK - SLIM Dual 1/4\" Jack St","R4K2JACK"]
["R4KCB13 - SLIM Code Button St","R4KCB13"]
["R4KPB12 - SLIM Single Button St","R4KPB12"]
["R4KPB23 - SLIM Dual Button w/ Code St","R4KPB23"]
["R4KPC11 - SLIM Pull Cord St","R4KPC11"]
{"$rows_left_out":71}